From Fedora Project Wiki

Kernel 5.8 Test Week
Test-days-banner.svg

Date 2020-08-17 to 2020-08-24
Time all week

Website QA/Test Days
IRC #fedora-test-day (webirc)
Mailing list test


Note.png
Can't make the date?
If you come to this page before or after the test day is completed, your testing is still valuable, and you can use the information on this page to test, file any bugs you find at Bugzilla, and add your results to the results section. If this page is more than a month old when you arrive here, please check the current schedule and see if a similar but more recent Test Day is planned or has already happened.

What to test?[edit]

This Test Day will focus on the 5.8 linux kernel. The primary aim is as a rebase candidate for Fedora 32 and 31, but 5.8 will also be the kernel series that Fedora 33 is released on.

Who's available[edit]

The following cast of characters will be available testing, workarounds, bug fixes, and general discussion:

You can chat with us on IRC. See the infobox on top of the page to learn the right IRC channel.

Prerequisite for Test Day[edit]

  • A fully updated test day image or Fedora 31 or 32 Workstation/Server installation, either on bare metal or VM (please make sure you have no important data on that installation, things might go wrong -- don't do this on your production machine!)
  • The 5.8 kernel for an existing installation from F32 koji (see below) or kernel-stabilization copr if not using the test day image. (koji is recommended for secure boot users). This kernel should install fine on F32 systems.
  • Fedora Silverblue users can test using the koji kernel above as well. Download the kernel locally and install it with rpm-ostree override replace <path to package>
  • Enough free space on HDD

Koji download instructions[edit]

Kernel builds can be downloaded from Koji using a command line tool:

koji download-build --arch=x86_64 kernel-5.8.2-300.fc32 && sudo dnf update kernel*

How to test?[edit]

Run the tests[edit]

  1. Follow the instructions in this test case. For users running the test day image, the tests are pre-installed in /home/liveuser/kernel-tests/.
  2. Visit the result page and enter your result in the 'Regression' column by clicking Enter result.
  3. If there are any other result columns, click on the column title links to see the tests that need to be run: most column titles are links to a specific test case. Follow the instructions there, then enter your results by clicking the Enter result button for the test.
  4. While the results from the regression tests are interesting, we are also interested in your overall experience with the new kernels.

Reporting bugs[edit]

If you have problems with any of the tests, have a look in the results page. Please include the vulnerability output at the end of the test suite in the comments.

If you don't see it, please file a new bug to Bugzilla, probably against kernel component.  If you are unsure about exactly how to file the report or what other information to include, just ask on IRC #fedora-test-day or #fedora-qa and we will help you.


Test Results[edit]

Test results will be exported here once the test day is over. See How to test? section for information how to submit results and see the live results.

Regression Test[edit]

User Profile Regression References
ahmadhassan7 https://github.com/ahmadhassan7
Pass pass
[1]
  1. RHBZ #752835 RHBZ #25531 All tests either passed or skipped.
akumar99 kerneltest-5.8.1.iso on VMware (AMD Ryzen 9 3900X)
Pass pass
[1]
Pass pass
[2]
Pass pass
  1. Successfully completed with a performance test suite.
  2. All tests passed or skipped. he following information is not submitted with your log; it is for informational purposes only. Checking for kernel signature: The signer's common name is Fedora Secure Boot Signer The signer's common name is kernel-signer Vulnerability status: /sys/devices/system/cpu/vulnerabilities/itlb_multihit:Not affected /sys/devices/system/cpu/vulnerabilities/l1tf:Not affected /sys/devices/system/cpu/vulnerabilities/mds:Not affected /sys/devices/system/cpu/vulnerabilities/meltdown:Not affected /sys/devices/system/cpu/vulnerabilities/spec_store_bypass:Mitigation: Speculative Store Bypass disabled via prctl and seccomp /sys/devices/system/cpu/vulnerabilities/spectre_v1:Mitigation: usercopy/swapgs barriers and __user pointer sanitization /sys/devices/system/cpu/vulnerabilities/spectre_v2:Mitigation: Full AMD retpoline, IBPB: conditional, STIBP: disabled, RSB filling /sys/devices/system/cpu/vulnerabilities/srbds:Not affected /sys/devices/system/cpu/vulnerabilities/tsx_async_abort:Not affected
alciregi Dell XPS 13 9360, Intel i7-7500U, F32 Workstation
Pass pass
[1]
  1. Vulnerability status: /sys/devices/system/cpu/vulnerabilities/itlb_multihit:KVM: Mitigation: Split huge pages /sys/devices/system/cpu/vulnerabilities/l1tf:Mitigation: PTE Inversion; VMX: conditional cache flushes, SMT vulnerable /sys/devices/system/cpu/vulnerabilities/mds:Mitigation: Clear CPU buffers; SMT vulnerable /sys/devices/system/cpu/vulnerabilities/meltdown:Mitigation: PTI /sys/devices/system/cpu/vulnerabilities/spec_store_bypass:Mitigation: Speculative Store Bypass disabled via prctl and seccomp /sys/devices/system/cpu/vulnerabilities/spectre_v1:Mitigation: usercopy/swapgs barriers and __user pointer sanitization /sys/devices/system/cpu/vulnerabilities/spectre_v2:Mitigation: Full generic retpoline, IBPB: conditional, IBRS_FW, STIBP: conditional, RSB filling /sys/devices/system/cpu/vulnerabilities/srbds:Mitigation: Microcode /sys/devices/system/cpu/vulnerabilities/tsx_async_abort:Not affected
alciregi F32 Raspberry Pi 3 aarch64
Pass pass
[1]
Pass pass
[2]
  1. destructive profile
  2. default
alciregi Intel i5-7400 Fedora 32
Pass pass
[1]
  1. Vulnerability status: /sys/devices/system/cpu/vulnerabilities/itlb_multihit:KVM: Mitigation: Split huge pages /sys/devices/system/cpu/vulnerabilities/l1tf:Mitigation: PTE Inversion; VMX: conditional cache flushes, SMT disabled /sys/devices/system/cpu/vulnerabilities/mds:Mitigation: Clear CPU buffers; SMT disabled /sys/devices/system/cpu/vulnerabilities/meltdown:Mitigation: PTI /sys/devices/system/cpu/vulnerabilities/spec_store_bypass:Mitigation: Speculative Store Bypass disabled via prctl and seccomp /sys/devices/system/cpu/vulnerabilities/spectre_v1:Mitigation: usercopy/swapgs barriers and __user pointer sanitization /sys/devices/system/cpu/vulnerabilities/spectre_v2:Mitigation: Full generic retpoline, IBPB: conditional, IBRS_FW, STIBP: disabled, RSB filling /sys/devices/system/cpu/vulnerabilities/srbds:Mitigation: Microcode /sys/devices/system/cpu/vulnerabilities/tsx_async_abort:Not affected
alciregi Toshiba Portege R930-1H9 Intel i5-3340M
Pass pass
[1]
  1. Default profile Vulnerability status: /sys/devices/system/cpu/vulnerabilities/itlb_multihit:KVM: Mitigation: Split huge pages /sys/devices/system/cpu/vulnerabilities/l1tf:Mitigation: PTE Inversion; VMX: conditional cache flushes, SMT vulnerable /sys/devices/system/cpu/vulnerabilities/mds:Mitigation: Clear CPU buffers; SMT vulnerable /sys/devices/system/cpu/vulnerabilities/meltdown:Mitigation: PTI /sys/devices/system/cpu/vulnerabilities/spec_store_bypass:Mitigation: Speculative Store Bypass disabled via prctl and seccomp /sys/devices/system/cpu/vulnerabilities/spectre_v1:Mitigation: usercopy/swapgs barriers and __user pointer sanitization /sys/devices/system/cpu/vulnerabilities/spectre_v2:Mitigation: Full generic retpoline, IBPB: conditional, IBRS_FW, STIBP: conditional, RSB filling /sys/devices/system/cpu/vulnerabilities/srbds:Vulnerable: No microcode /sys/devices/system/cpu/vulnerabilities/tsx_async_abort:Not affected
alphacluster CPU: Ryzen 9 3900X GPU: Radeon Pro WX2100 Mobo: x570
Pass pass
ama Dell XPS 15 9550 i5-6300HQ, kerneltest-livecd
Pass pass
[1]
  1. All things work as expected.
ama Lenovo T14 Gen1 2020 AMD Ryzen 5, Kerneltest-livecd
Pass pass
[1]
  1. - Found that closing the laptop lid does not put the system in suspend mode. Not sure this is a Gnome setting or a general issue.
aptupdate Pinebook Pro, Fedora 32 aarch64
Fail fail
[1]
  1. RHBZ #1869963 Pinebook Pro do not boot Fedora kernel. No output on screen.
archmunky i5-6600k @ 3.5GHz, 32GB RAM, RX580 (livecd)
Pass pass
[1]
  1. Default: PASS (skip paxtest, libhugetlbfs) Performance: PASS (scripts getlist, getsummary permission denied)
archmunky laptop hp 14-CF0013DX (livecd)
Pass pass
[1]
  1. Default: WARN (sysfs-perms) SKIP (paxtest,libhugetlbfs) Performance: PASS
arnoxm ASUS Zenbook UX430UQ Intel® Core™ i7-7500U CPU F32 with 5.8.1-300.fc32.x86_64 kernel (VM)
Pass pass
[1]
  1. Vulnerability status: /sys/devices/system/cpu/vulnerabilities/itlb_multihit:Not affected /sys/devices/system/cpu/vulnerabilities/l1tf:Mitigation: PTE Inversion; VMX: flush not necessary, SMT vulnerable /sys/devices/system/cpu/vulnerabilities/mds:Mitigation: Clear CPU buffers; SMT Host state unknown /sys/devices/system/cpu/vulnerabilities/meltdown:Mitigation: PTI /sys/devices/system/cpu/vulnerabilities/spec_store_bypass:Mitigation: Speculative Store Bypass disabled via prctl and seccomp /sys/devices/system/cpu/vulnerabilities/spectre_v1:Mitigation: usercopy/swapgs barriers and __user pointer sanitization /sys/devices/system/cpu/vulnerabilities/spectre_v2:Mitigation: Full generic retpoline, IBPB: conditional, IBRS_FW, STIBP: conditional, RSB filling /sys/devices/system/cpu/vulnerabilities/srbds:Unknown: Dependent on hypervisor status /sys/devices/system/cpu/vulnerabilities/tsx_async_abort:Not affected
arnoxm Asus Zenboox UX430UQ CPU: Core i7-7500U GPU: GTX 940MX/Intel HD Graphics 620 (KBL GT2) RAM: 16GiB Test Day Image LiveUSB, 5.8.1-300.fc32.x86_64
Pass pass
[1]
  1. 2. All Performance Tests passed. Vulnerability status: /sys/devices/system/cpu/vulnerabilities/itlb_multihit:KVM: Mitigation: Split huge pages /sys/devices/system/cpu/vulnerabilities/l1tf:Mitigation: PTE Inversion; VMX: conditional cache flushes, SMT vulnerable /sys/devices/system/cpu/vulnerabilities/mds:Mitigation: Clear CPU buffers; SMT vulnerable /sys/devices/system/cpu/vulnerabilities/meltdown:Mitigation: PTI /sys/devices/system/cpu/vulnerabilities/spec_store_bypass:Mitigation: Speculative Store Bypass disabled via prctl and seccomp /sys/devices/system/cpu/vulnerabilities/spectre_v1:Mitigation: usercopy/swapgs barriers and __user pointer sanitization /sys/devices/system/cpu/vulnerabilities/spectre_v2:Mitigation: Full generic retpoline, IBPB: conditional, IBRS_FW, STIBP: conditional, RSB filling /sys/devices/system/cpu/vulnerabilities/srbds:Mitigation: Microcode /sys/devices/system/cpu/vulnerabilities/tsx_async_abort:Not affected
arnoxm CPU: Core i3-2120 GPU: Geforce GT620 RAM: 4GiB, Test Day Image on LiveUSB
Fail fail
[1]
  1. 1. Default Tests Test suite called with default ./default/paxtest SKIP ./default/memfd PASS ./default/sysfs-perms WARN ./default/modsign PASS ./default/stack-randomness PASS ./default/selinux-dac-controls PASS ./default/insert_leap_second PASS ./default/timer-overhead PASS ./default/cachedrop FAIL ./default/libhugetlbfs SKIP ./default/mq-memory-corruption PASS ./default/posix_timers PASS Vulnerability status: /sys/devices/system/cpu/vulnerabilities/itlb_multihit:KVM: Mitigation: Split huge pages /sys/devices/system/cpu/vulnerabilities/l1tf:Mitigation: PTE Inversion; VMX: conditional cache flushes, SMT vulnerable /sys/devices/system/cpu/vulnerabilities/mds:Mitigation: Clear CPU buffers; SMT vulnerable /sys/devices/system/cpu/vulnerabilities/meltdown:Mitigation: PTI /sys/devices/system/cpu/vulnerabilities/spec_store_bypass:Mitigation: Speculative Store Bypass disabled via prctl and seccomp /sys/devices/system/cpu/vulnerabilities/spectre_v1:Mitigation: usercopy/swapgs barriers and __user pointer sanitization /sys/devices/system/cpu/vulnerabilities/spectre_v2:Mitigation: Full generic retpoline, IBPB: conditional, IBRS_FW, STIBP: conditional, RSB filling /sys/devices/system/cpu/vulnerabilities/srbds:Not affected /sys/devices/system/cpu/vulnerabilities/tsx_async_abort:Not affected
ashish.dav99@gmail.com kerneltest-5.8.1.iso on VMware (AMD Ryzen 9 3900X)
Pass pass
[1]
  1. All tests either passed or skipped.
atim CPU: Quad Core AMD Athlon X4 845; NVIDIA GP106 [GeForce GTX 1060 6GB] driver: nvidia v: 450.66
Pass pass
[1]
  1. All works. Results uploaded.
augenauf F32 with kernel 5.8.1-300.fc32 (downloaded from koji) in VM (Virtualbox)
Pass pass
[1]
Warning warn
[2]
  1. Test suite called with default ^C./default/insert_leap_second PASS ./default/sysfs-perms PASS ./default/mq-memory-corruption PASS ./default/modsign PASS ./default/timer-overhead PASS ./default/paxtest SKIP ./default/posix_timers PASS ./default/selinux-dac-controls PASS ./default/stack-randomness PASS ./default/libhugetlbfs SKIP ./default/cachedrop PASS ./default/memfd PASS Test suite complete PASS Your log file is being submitted... Upload successful! The following information is not submitted with your log; it is for informational purposes only. Vulnerability status: /sys/devices/system/cpu/vulnerabilities/itlb_multihit:KVM: Vulnerable /sys/devices/system/cpu/vulnerabilities/l1tf:Not affected /sys/devices/system/cpu/vulnerabilities/mds:Mitigation: Clear CPU buffers; SMT Host state unknown /sys/devices/system/cpu/vulnerabilities/meltdown:Not affected /sys/devices/system/cpu/vulnerabilities/spec_store_bypass:Vulnerable /sys/devices/system/cpu/vulnerabilities/spectre_v1:Mitigation: usercopy/swapgs barriers and __user pointer sanitization /sys/devices/system/cpu/vulnerabilities/spectre_v2:Mitigation: Full generic retpoline, STIBP: disabled, RSB filling /sys/devices/system/cpu/vulnerabilities/srbds:Unknown: Dependent on hypervisor status /sys/devices/system/cpu/vulnerabilities/tsx_async_abort:Not affected
  2. no regression noted, system runs just fine. My general problem is that the kernel test suite hangs (also during previous tests of 5.7, 5.6, 5.x, ...). It says:
    Test suite called with default
    
    . Sometimes, it seems completely random, it continues the test minutes (or half an hour later) - I don't think I experience this on bare-metal...
bd6627 Lenovo E550 i5-5200 HD 5500 Graphics Fedora 32
Pass pass
bd6627 Lenovo E550 i5-5200 HD 5500 Graphics Test Day
Pass pass
[1]
  1. Test suite called with default ./default/cachedrop PASS ./default/insert_leap_second PASS ./default/libhugetlbfs SKIP ./default/memfd PASS ./default/modsign PASS ./default/mq-memory-corruption PASS ./default/paxtest SKIP ./default/posix_timers PASS ./default/selinux-dac-controls PASS ./default/stack-randomness PASS ./default/sysfs-perms PASS ./default/timer-overhead PASS Test suite complete PASS Test suite called with performance lib_timing.c: In function ‘touch’: lib_timing.c:1626:9: warning: type defaults to ‘int’ in declaration of ‘psize’ [-Wimplicit-int] 1626 | static psize; | ^~~~~ lib_sched.c: In function ‘handle_scheduler’: lib_sched.c:94:3: warning: ‘return’ with no value, in function returning non-void 94 | return; | ^~~~~~ lib_sched.c:46:1: note: declared here 46 | handle_scheduler(int childno, int benchproc, int nbenchprocs) | ^~~~~~~~~~~~~~~~ lib_sched.c: In function ‘sched_pin’: lib_sched.c:207:12: warning: implicit declaration of function ‘sched_getaffinity’ [-Wimplicit-function-declaration] 207 | retval = sched_getaffinity(0, sz * sizeof(unsigned long), cpumask); | ^~~~~~~~~~~~~~~~~ lib_sched.c:231:11: warning: implicit declaration of function ‘sched_setaffinity’ [-Wimplicit-function-declaration] 231 | retval = sched_setaffinity(0, sz * sizeof(unsigned long), mask); | ^~~~~~~~~~~~~~~~~ bw_file_rd.c: In function ‘main’: bw_file_rd.c:149:23: warning: implicit declaration of function ‘lmbench_usage’ [-Wimplicit-function-declaration] 149 | if (parallel <= 0) lmbench_usage(ac, av, usage); | ^~~~~~~~~~~~~ bw_mem.c: In function ‘main’: bw_mem.c:76:23: warning: implicit declaration of function ‘lmbench_usage’ [-Wimplicit-function-declaration] 76 | if (parallel <= 0) lmbench_usage(ac, av, usage); | ^~~~~~~~~~~~~ bw_mmap_rd.c: In function ‘main’: bw_mmap_rd.c:64:23: warning: implicit declaration of function ‘lmbench_usage’ [-Wimplicit-function-declaration] 64 | if (parallel <= 0) lmbench_usage(ac, av, usage); | ^~~~~~~~~~~~~ bw_pipe.c: In function ‘main’: bw_pipe.c:157:23: warning: implicit declaration of function ‘lmbench_usage’ [-Wimplicit-function-declaration] 157 | if (parallel <= 0) lmbench_usage(ac, av, usage); | ^~~~~~~~~~~~~ bw_tcp.c: In function ‘main’: bw_tcp.c:74:23: warning: implicit declaration of function ‘lmbench_usage’ [-Wimplicit-function-declaration] 74 | if (parallel <= 0) lmbench_usage(ac, av, usage); | ^~~~~~~~~~~~~ bw_unix.c: In function ‘main’: bw_unix.c:153:23: warning: implicit declaration of function ‘lmbench_usage’ [-Wimplicit-function-declaration] 153 | if (parallel <= 0) lmbench_usage(argc, argv, usage); | ^~~~~~~~~~~~~ lat_select.c: In function ‘main’: lat_select.c:53:23: warning: implicit declaration of function ‘lmbench_usage’ [-Wimplicit-function-declaration] 53 | if (parallel <= 0) lmbench_usage(ac, av, usage); | ^~~~~~~~~~~~~ lat_select.c: In function ‘doit’: lat_select.c:167:9: warning: type defaults to ‘int’ in declaration of ‘count’ [-Wimplicit-int] 167 | static count = 0; | ^~~~~ lat_pipe.c: In function ‘main’: lat_pipe.c:41:23: warning: implicit declaration of function ‘lmbench_usage’ [-Wimplicit-function-declaration] 41 | if (parallel <= 0) lmbench_usage(ac, av, usage); | ^~~~~~~~~~~~~ lat_rpc.c: In function ‘main’: lat_rpc.c:136:5: warning: implicit declaration of function ‘lmbench_usage’ [-Wimplicit-function-declaration] 136 | lmbench_usage(ac, av, usage); | ^~~~~~~~~~~~~ lat_syscall.c: In function ‘main’: lat_syscall.c:116:23: warning: implicit declaration of function ‘lmbench_usage’ [-Wimplicit-function-declaration] 116 | if (parallel <= 0) lmbench_usage(ac, av, usage); | ^~~~~~~~~~~~~ lat_tcp.c: In function ‘main’: lat_tcp.c:64:5: warning: implicit declaration of function ‘lmbench_usage’ [-Wimplicit-function-declaration] 64 | lmbench_usage(ac, av, usage); | ^~~~~~~~~~~~~ lat_udp.c: In function ‘main’: lat_udp.c:78:5: warning: implicit declaration of function ‘lmbench_usage’ [-Wimplicit-function-declaration] 78 | lmbench_usage(ac, av, usage); | ^~~~~~~~~~~~~ lat_mmap.c: In function ‘main’: lat_mmap.c:58:5: warning: implicit declaration of function ‘lmbench_usage’ [-Wimplicit-function-declaration] 58 | lmbench_usage(ac, av, usage); | ^~~~~~~~~~~~~ mhz.c: In function ‘main’: mhz.c:492:4: warning: implicit declaration of function ‘lmbench_usage’ [-Wimplicit-function-declaration] 492 | lmbench_usage(ac, av, usage); | ^~~~~~~~~~~~~ lat_proc.c: In function ‘main’: lat_proc.c:60:23: warning: implicit declaration of function ‘lmbench_usage’ [-Wimplicit-function-declaration] 60 | if (parallel <= 0) lmbench_usage(ac, av, usage); | ^~~~~~~~~~~~~ lat_pagefault.c: In function ‘main’: lat_pagefault.c:54:23: warning: implicit declaration of function ‘lmbench_usage’ [-Wimplicit-function-declaration] 54 | if (parallel <= 0) lmbench_usage(ac, av, usage); | ^~~~~~~~~~~~~ lat_connect.c: In function ‘main’: lat_connect.c:63:4: warning: implicit declaration of function ‘lmbench_usage’ [-Wimplicit-function-declaration] 63 | lmbench_usage(ac, av, usage); | ^~~~~~~~~~~~~ lat_fs.c: In function ‘main’: lat_fs.c:55:23: warning: implicit declaration of function ‘lmbench_usage’ [-Wimplicit-function-declaration] 55 | if (parallel <= 0) lmbench_usage(ac, av, usage); | ^~~~~~~~~~~~~ /usr/bin/ld: /tmp/cc3sZcwE.o: in function setup_names': lat_fs.c:(.text+0x831): warning: the use of tempnam' is dangerous, better use `mkstemp' lat_sig.c: In function ‘main’: lat_sig.c:182:23: warning: implicit declaration of function ‘lmbench_usage’ [-Wimplicit-function-declaration] 182 | if (parallel <= 0) lmbench_usage(ac, av, usage); | ^~~~~~~~~~~~~ lat_mem_rd.c: In function ‘main’: lat_mem_rd.c:47:23: warning: implicit declaration of function ‘lmbench_usage’ [-Wimplicit-function-declaration] 47 | if (parallel <= 0) lmbench_usage(ac, av, usage); | ^~~~~~~~~~~~~ lat_ctx.c: In function ‘main’: lat_ctx.c:74:23: warning: implicit declaration of function ‘lmbench_usage’ [-Wimplicit-function-declaration] 74 | if (parallel <= 0) lmbench_usage(ac, av, usage); | ^~~~~~~~~~~~~ lat_sem.c: In function ‘main’: lat_sem.c:42:23: warning: implicit declaration of function ‘lmbench_usage’ [-Wimplicit-function-declaration] 42 | if (parallel <= 0) lmbench_usage(ac, av, usage); | ^~~~~~~~~~~~~ lat_unix.c: In function ‘main’: lat_unix.c:46:23: warning: implicit declaration of function ‘lmbench_usage’ [-Wimplicit-function-declaration] 46 | if (parallel <= 0) lmbench_usage(ac, av, usage); | ^~~~~~~~~~~~~ lat_fifo.c: In function ‘main’: lat_fifo.c:45:23: warning: implicit declaration of function ‘lmbench_usage’ [-Wimplicit-function-declaration] 45 | if (parallel <= 0) lmbench_usage(ac, av, usage); | ^~~~~~~~~~~~~ lat_http.c: In function ‘main’: lat_http.c:84:4: warning: implicit declaration of function ‘lmbench_usage’ [-Wimplicit-function-declaration] 84 | lmbench_usage(ac, av, usage); | ^~~~~~~~~~~~~ lat_fcntl.c: In function ‘main’: lat_fcntl.c:203:23: warning: implicit declaration of function ‘lmbench_usage’ [-Wimplicit-function-declaration] 203 | if (parallel <= 0) lmbench_usage(ac, av, usage); | ^~~~~~~~~~~~~ lat_unix_connect.c: In function ‘main’: lat_unix_connect.c:63:23: warning: implicit declaration of function ‘lmbench_usage’ [-Wimplicit-function-declaration] 63 | if (parallel <= 0) lmbench_usage(ac, av, usage); | ^~~~~~~~~~~~~ lat_ops.c: In function ‘main’: lat_ops.c:393:23: warning: implicit declaration of function ‘lmbench_usage’ [-Wimplicit-function-declaration] 393 | if (parallel <= 0) lmbench_usage(ac, av, usage); | ^~~~~~~~~~~~~ line.c: In function ‘main’: line.c:54:4: warning: implicit declaration of function ‘lmbench_usage’ [-Wimplicit-function-declaration] 54 | lmbench_usage(ac, av, usage); | ^~~~~~~~~~~~~ tlb.c: In function ‘main’: tlb.c:69:4: warning: implicit declaration of function ‘lmbench_usage’ [-Wimplicit-function-declaration] 69 | lmbench_usage(ac, av, usage); | ^~~~~~~~~~~~~ par_mem.c: In function ‘main’: par_mem.c:64:4: warning: implicit declaration of function ‘lmbench_usage’ [-Wimplicit-function-declaration] 64 | lmbench_usage(ac, av, usage); | ^~~~~~~~~~~~~ par_ops.c: In function ‘main’: par_ops.c:413:4: warning: implicit declaration of function ‘lmbench_usage’ [-Wimplicit-function-declaration] 413 | lmbench_usage(ac, av, usage); | ^~~~~~~~~~~~~ stream.c: In function ‘main’: stream.c:70:5: warning: implicit declaration of function ‘lmbench_usage’ [-Wimplicit-function-declaration] 70 | lmbench_usage(ac, av, usage); | ^~~~~~~~~~~~~ cache.c: In function ‘main’: cache.c:123:4: warning: implicit declaration of function ‘lmbench_usage’ [-Wimplicit-function-declaration] 123 | lmbench_usage(ac, av, usage); | ^~~~~~~~~~~~~ lat_dram_page.c: In function ‘main’: lat_dram_page.c:66:4: warning: implicit declaration of function ‘lmbench_usage’ [-Wimplicit-function-declaration] 66 | lmbench_usage(ac, av, usage); | ^~~~~~~~~~~~~ lat_pmake.c: In function ‘main’: lat_pmake.c:47:23: warning: implicit declaration of function ‘lmbench_usage’ [-Wimplicit-function-declaration] 47 | if (parallel <= 0) lmbench_usage(ac, av, usage); | ^~~~~~~~~~~~~ lat_rand.c: In function ‘main’: lat_rand.c:39:23: warning: implicit declaration of function ‘lmbench_usage’ [-Wimplicit-function-declaration] 39 | if (parallel <= 0) lmbench_usage(ac, av, usage); | ^~~~~~~~~~~~~ lat_usleep.c: In function ‘main’: lat_usleep.c:204:3: warning: implicit declaration of function ‘lmbench_usage’ [-Wimplicit-function-declaration] 204 | lmbench_usage(ac, av, usage); | ^~~~~~~~~~~~~ lat_cmd.c: In function ‘main’: lat_cmd.c:40:23: warning: implicit declaration of function ‘lmbench_usage’ [-Wimplicit-function-declaration] 40 | if (parallel <= 0) lmbench_usage(ac, av, usage); | ^~~~~~~~~~~~~ 11145MB OK 11145MB OK 11145MB OK Using config in CONFIG.localhost.localdomain Mon 17 Aug 2020 10:18:51 PM EDT Latency measurements Mon 17 Aug 2020 10:47:00 PM EDT Calculating file system latency Mon 17 Aug 2020 10:47:02 PM EDT Local networking Mon 17 Aug 2020 10:50:44 PM EDT Bandwidth measurements Mon 17 Aug 2020 10:58:20 PM EDT Calculating context switch overhead Mon 17 Aug 2020 10:58:24 PM EDT ./performance/lmbench3 PASS Test suite complete PASS
boeroboy Bare Metal F32, HP Z640 2x10 Xeon E5-2660v3, 2x64GB DDR4-LRDIMM, NVidia Quadro RTX4000, AMD Radeon Pro WX2100
Pass pass
[1]
  1. Ran in-place in existing Fedora 32 install. Needed to unblocklist nouveau and build custom dracut with AMD firmware for video to work. Strange USB keyboard glitch wouldn't let me hit ESC during boot until those two were sorted - had to remove rhgb param instead. Strange behaviour in drop_caches trying to read instead of write?? cat: /proc/sys/vm/drop_caches: Permission denied
chivux kerneltest-5.8.1.iso on AMD Trinity X2 AMD A6-4400M APU with Radeon(tm) HD Graphics TOSHIBA Portable PC MP Insyde Corp. 6.20 Advanced Micro Devices, Inc. [AMD] FCH LPC Bridge Linux 5.8.1-300.fc32.x86_64 Fedora 32 (Workstation Edition) localhost-live
Pass pass
[1]
  1. Test suite called with performance lib_timing.c: In function ‘touch’: lib_timing.c:1626:9: warning: type defaults to ‘int’ in declaration of ‘psize’ [-Wimplicit-int] 1626 | static psize; | ^~~~~ lib_sched.c: In function ‘handle_scheduler’: lib_sched.c:94:3: warning: ‘return’ with no value, in function returning non-void 94 | return; | ^~~~~~ lib_sched.c: In function ‘sched_pin’: lib_sched.c:207:12: warning: implicit declaration of function ‘sched_getaffinity’ [-Wimplicit-function-declaration] 207 | retval = sched_getaffinity(0, sz * sizeof(unsigned long), cpumask); | ^~~~~~~~~~~~~~~~~ lib_sched.c:231:11: warning: implicit declaration of function ‘sched_setaffinity’ [-Wimplicit-function-declaration] 231 | retval = sched_setaffinity(0, sz * sizeof(unsigned long), mask); | ^~~~~~~~~~~~~~~~~ bw_file_rd.c: In function ‘main’: bw_file_rd.c:149:23: warning: implicit declaration of function ‘lmbench_usage’ [-Wimplicit-function-declaration] 149 | if (parallel <= 0) lmbench_usage(ac, av, usage); | ^~~~~~~~~~~~~ bw_mem.c: In function ‘main’: bw_mem.c:76:23: warning: implicit declaration of function ‘lmbench_usage’ [-Wimplicit-function-declaration] 76 | if (parallel <= 0) lmbench_usage(ac, av, usage); | ^~~~~~~~~~~~~ bw_mmap_rd.c: In function ‘main’: bw_mmap_rd.c:64:23: warning: implicit declaration of function ‘lmbench_usage’ [-Wimplicit-function-declaration] 64 | if (parallel <= 0) lmbench_usage(ac, av, usage); | ^~~~~~~~~~~~~ bw_pipe.c: In function ‘main’: bw_pipe.c:157:23: warning: implicit declaration of function ‘lmbench_usage’ [-Wimplicit-function-declaration] 157 | if (parallel <= 0) lmbench_usage(ac, av, usage); | ^~~~~~~~~~~~~ bw_tcp.c: In function ‘main’: bw_tcp.c:74:23: warning: implicit declaration of function ‘lmbench_usage’ [-Wimplicit-function-declaration] 74 | if (parallel <= 0) lmbench_usage(ac, av, usage); | ^~~~~~~~~~~~~ bw_unix.c: In function ‘main’: bw_unix.c:153:23: warning: implicit declaration of function ‘lmbench_usage’ [-Wimplicit-function-declaration] 153 | if (parallel <= 0) lmbench_usage(argc, argv, usage); | ^~~~~~~~~~~~~ lat_select.c: In function ‘main’: lat_select.c:53:23: warning: implicit declaration of function ‘lmbench_usage’ [-Wimplicit-function-declaration] 53 | if (parallel <= 0) lmbench_usage(ac, av, usage); | ^~~~~~~~~~~~~ lat_select.c: In function ‘doit’: lat_select.c:167:9: warning: type defaults to ‘int’ in declaration of ‘count’ [-Wimplicit-int] 167 | static count = 0; | ^~~~~ lat_pipe.c: In function ‘main’: lat_pipe.c:41:23: warning: implicit declaration of function ‘lmbench_usage’ [-Wimplicit-function-declaration] 41 | if (parallel <= 0) lmbench_usage(ac, av, usage); | ^~~~~~~~~~~~~ lat_rpc.c: In function ‘main’: lat_rpc.c:136:5: warning: implicit declaration of function ‘lmbench_usage’ [-Wimplicit-function-declaration] 136 | lmbench_usage(ac, av, usage); | ^~~~~~~~~~~~~ lat_syscall.c: In function ‘main’: lat_syscall.c:116:23: warning: implicit declaration of function ‘lmbench_usage’ [-Wimplicit-function-declaration] 116 | if (parallel <= 0) lmbench_usage(ac, av, usage); | ^~~~~~~~~~~~~ lat_tcp.c: In function ‘main’: lat_tcp.c:64:5: warning: implicit declaration of function ‘lmbench_usage’ [-Wimplicit-function-declaration] 64 | lmbench_usage(ac, av, usage); | ^~~~~~~~~~~~~ lat_udp.c: In function ‘main’: lat_udp.c:78:5: warning: implicit declaration of function ‘lmbench_usage’ [-Wimplicit-function-declaration] 78 | lmbench_usage(ac, av, usage); | ^~~~~~~~~~~~~ lat_mmap.c: In function ‘main’: lat_mmap.c:58:5: warning: implicit declaration of function ‘lmbench_usage’ [-Wimplicit-function-declaration] 58 | lmbench_usage(ac, av, usage); | ^~~~~~~~~~~~~ mhz.c: In function ‘main’: mhz.c:492:4: warning: implicit declaration of function ‘lmbench_usage’ [-Wimplicit-function-declaration] 492 | lmbench_usage(ac, av, usage); | ^~~~~~~~~~~~~ lat_proc.c: In function ‘main’: lat_proc.c:60:23: warning: implicit declaration of function ‘lmbench_usage’ [-Wimplicit-function-declaration] 60 | if (parallel <= 0) lmbench_usage(ac, av, usage); | ^~~~~~~~~~~~~ lat_pagefault.c: In function ‘main’: lat_pagefault.c:54:23: warning: implicit declaration of function ‘lmbench_usage’ [-Wimplicit-function-declaration] 54 | if (parallel <= 0) lmbench_usage(ac, av, usage); | ^~~~~~~~~~~~~ lat_connect.c: In function ‘main’: lat_connect.c:63:4: warning: implicit declaration of function ‘lmbench_usage’ [-Wimplicit-function-declaration] 63 | lmbench_usage(ac, av, usage); | ^~~~~~~~~~~~~ lat_fs.c: In function ‘main’: lat_fs.c:55:23: warning: implicit declaration of function ‘lmbench_usage’ [-Wimplicit-function-declaration] 55 | if (parallel <= 0) lmbench_usage(ac, av, usage); | ^~~~~~~~~~~~~ /usr/bin/ld: /tmp/cc4P6dp7.o: in function setup_names': lat_fs.c:(.text+0x831): warning: the use of tempnam' is dangerous, better use `mkstemp' lat_sig.c: In function ‘main’: lat_sig.c:182:23: warning: implicit declaration of function ‘lmbench_usage’ [-Wimplicit-function-declaration] 182 | if (parallel <= 0) lmbench_usage(ac, av, usage); | ^~~~~~~~~~~~~ lat_mem_rd.c: In function ‘main’: lat_mem_rd.c:47:23: warning: implicit declaration of function ‘lmbench_usage’ [-Wimplicit-function-declaration] 47 | if (parallel <= 0) lmbench_usage(ac, av, usage); | ^~~~~~~~~~~~~ lat_ctx.c: In function ‘main’: lat_ctx.c:74:23: warning: implicit declaration of function ‘lmbench_usage’ [-Wimplicit-function-declaration] 74 | if (parallel <= 0) lmbench_usage(ac, av, usage); | ^~~~~~~~~~~~~ lat_sem.c: In function ‘main’: lat_sem.c:42:23: warning: implicit declaration of function ‘lmbench_usage’ [-Wimplicit-function-declaration] 42 | if (parallel <= 0) lmbench_usage(ac, av, usage); | ^~~~~~~~~~~~~ lat_unix.c: In function ‘main’: lat_unix.c:46:23: warning: implicit declaration of function ‘lmbench_usage’ [-Wimplicit-function-declaration] 46 | if (parallel <= 0) lmbench_usage(ac, av, usage); | ^~~~~~~~~~~~~ lat_fifo.c: In function ‘main’: lat_fifo.c:45:23: warning: implicit declaration of function ‘lmbench_usage’ [-Wimplicit-function-declaration] 45 | if (parallel <= 0) lmbench_usage(ac, av, usage); | ^~~~~~~~~~~~~ lat_http.c: In function ‘main’: lat_http.c:84:4: warning: implicit declaration of function ‘lmbench_usage’ [-Wimplicit-function-declaration] 84 | lmbench_usage(ac, av, usage); | ^~~~~~~~~~~~~ lat_fcntl.c: In function ‘main’: lat_fcntl.c:203:23: warning: implicit declaration of function ‘lmbench_usage’ [-Wimplicit-function-declaration] 203 | if (parallel <= 0) lmbench_usage(ac, av, usage); | ^~~~~~~~~~~~~ lat_unix_connect.c: In function ‘main’: lat_unix_connect.c:63:23: warning: implicit declaration of function ‘lmbench_usage’ [-Wimplicit-function-declaration] 63 | if (parallel <= 0) lmbench_usage(ac, av, usage); | ^~~~~~~~~~~~~ lat_ops.c: In function ‘main’: lat_ops.c:393:23: warning: implicit declaration of function ‘lmbench_usage’ [-Wimplicit-function-declaration] 393 | if (parallel <= 0) lmbench_usage(ac, av, usage); | ^~~~~~~~~~~~~ line.c: In function ‘main’: line.c:54:4: warning: implicit declaration of function ‘lmbench_usage’ [-Wimplicit-function-declaration] 54 | lmbench_usage(ac, av, usage); | ^~~~~~~~~~~~~ tlb.c: In function ‘main’: tlb.c:69:4: warning: implicit declaration of function ‘lmbench_usage’ [-Wimplicit-function-declaration] 69 | lmbench_usage(ac, av, usage); | ^~~~~~~~~~~~~ par_mem.c: In function ‘main’: par_mem.c:64:4: warning: implicit declaration of function ‘lmbench_usage’ [-Wimplicit-function-declaration] 64 | lmbench_usage(ac, av, usage); | ^~~~~~~~~~~~~ par_ops.c: In function ‘main’: par_ops.c:413:4: warning: implicit declaration of function ‘lmbench_usage’ [-Wimplicit-function-declaration] 413 | lmbench_usage(ac, av, usage); | ^~~~~~~~~~~~~ stream.c: In function ‘main’: stream.c:70:5: warning: implicit declaration of function ‘lmbench_usage’ [-Wimplicit-function-declaration] 70 | lmbench_usage(ac, av, usage); | ^~~~~~~~~~~~~ cache.c: In function ‘main’: cache.c:123:4: warning: implicit declaration of function ‘lmbench_usage’ [-Wimplicit-function-declaration] 123 | lmbench_usage(ac, av, usage); | ^~~~~~~~~~~~~ lat_dram_page.c: In function ‘main’: lat_dram_page.c:66:4: warning: implicit declaration of function ‘lmbench_usage’ [-Wimplicit-function-declaration] 66 | lmbench_usage(ac, av, usage); | ^~~~~~~~~~~~~ lat_pmake.c: In function ‘main’: lat_pmake.c:47:23: warning: implicit declaration of function ‘lmbench_usage’ [-Wimplicit-function-declaration] 47 | if (parallel <= 0) lmbench_usage(ac, av, usage); | ^~~~~~~~~~~~~ lat_rand.c: In function ‘main’: lat_rand.c:39:23: warning: implicit declaration of function ‘lmbench_usage’ [-Wimplicit-function-declaration] 39 | if (parallel <= 0) lmbench_usage(ac, av, usage); | ^~~~~~~~~~~~~ lat_usleep.c: In function ‘main’: lat_usleep.c:204:3: warning: implicit declaration of function ‘lmbench_usage’ [-Wimplicit-function-declaration] 204 | lmbench_usage(ac, av, usage); | ^~~~~~~~~~~~~ lat_cmd.c: In function ‘main’: lat_cmd.c:40:23: warning: implicit declaration of function ‘lmbench_usage’ [-Wimplicit-function-declaration] 40 | if (parallel <= 0) lmbench_usage(ac, av, usage); | ^~~~~~~~~~~~~
darakus Intel i7-4790s AMD rx480 Test Day Image, bare metal
Pass pass
[1]
  1. Vulnerability status: /sys/devices/system/cpu/vulnerabilities/itlb_multihit:KVM: Mitigation: Split huge pages /sys/devices/system/cpu/vulnerabilities/l1tf:Mitigation: PTE Inversion; VMX: conditional cache flushes, SMT vulnerable /sys/devices/system/cpu/vulnerabilities/mds:Mitigation: Clear CPU buffers; SMT vulnerable /sys/devices/system/cpu/vulnerabilities/meltdown:Mitigation: PTI /sys/devices/system/cpu/vulnerabilities/spec_store_bypass:Mitigation: Speculative Store Bypass disabled via prctl and seccomp /sys/devices/system/cpu/vulnerabilities/spectre_v1:Mitigation: usercopy/swapgs barriers and __user pointer sanitization /sys/devices/system/cpu/vulnerabilities/spectre_v2:Mitigation: Full generic retpoline, IBPB: conditional, IBRS_FW, STIBP: conditional, RSB filling /sys/devices/system/cpu/vulnerabilities/srbds:Mitigation: Microcode /sys/devices/system/cpu/vulnerabilities/tsx_async_abort:Not affected
drakkai Lenovo ThinkPad T450 (i5-5300U, 16GB RAM) F32
Pass pass
eismann Ryzen 3700X | ASUS Strix X570-E
Pass pass
[1]
  1. All tests either passed or skipped.
ejnersan Dell Vostro 3558, Intel i3-4005U, Test-day Image, bare-metal
Pass pass
[1]
  1. Default: Pass Performance: Pass
ejnersan HP Elitebook 840 G3, Intel i5-6200U, Test-day Image, bare-metal
Pass pass
[1]
  1. Default and Performance: Pass
ejnersan HP ZBook 15 G4, Intel i7-7700HQ, LiveUSB
Pass pass
[1]
  1. Default and Performance: Pass Bandwidth measurements took 75 minutes...
eriklabianca F32 Workstation on ASUS Tuf-A15. Ryzen 4800h + gtx1660
Pass pass
[1]
  1. No regressions from 5.7 kernels. Ran both default and performance tests with both 5.8.1 and 5.8.2 from koji. All passed successfully and basic usage of the machine seems as good or better. Outstanding issues with display reset.
ernst Speicher 7,3 GiB; Prozessor AMD Athlon(tm)iix processor x 2; Grafik AMD RS; Festplatte 700,2 GB; Fedora 32 (Workstation Edition) x64
Pass pass
[1]
  1. Vulnerability status: /sys/devices/system/cpu/vulnerabilities/itlb_multihit:Not affected /sys/devices/system/cpu/vulnerabilities/l1tf:Not affected /sys/devices/system/cpu/vulnerabilities/mds:Not affected /sys/devices/system/cpu/vulnerabilities/meltdown:Not affected /sys/devices/system/cpu/vulnerabilities/spec_store_bypass:Not affected /sys/devices/system/cpu/vulnerabilities/spectre_v1:Mitigation: usercopy/swapgs barriers and __user pointer sanitization /sys/devices/system/cpu/vulnerabilities/spectre_v2:Mitigation: Full AMD retpoline, STIBP: disabled, RSB filling /sys/devices/system/cpu/vulnerabilities/srbds:Not affected /sys/devices/system/cpu/vulnerabilities/tsx_async_abort:Not affected
gabibbo97 CPU: AMD FX-8320 GPU: AMD Radeon R9 290; F32 Workstation
Pass pass
garrmcnu Test image on VM (KVM)
Pass pass
[1]
  1. Default and performance tests passed
geraldosimiao VM - Kernel: 5.8.2-300.fc32.x86_64
Pass pass
[1]
  1. KVM/quemu-system-x86_64/Q35/BIOS Date: sex 21 ago 2020 15:53:51 -03 Test set: default Kernel: 5.8.2-300.fc32.x86_64 Release: Fedora release 32 (Thirty Two) Result: PASS Failed Tests: None Warned Tests: None
gtb Thinkpad T510
Pass pass
[1]
  1. All tests PASS or SKIP
hinosaki Virtualbox 6.1 (3 core on AMD Ryzen 7 2700X with 8Gb RAM image) with F32 + 5.8.1-300.fc32.x86_64 daily kernel
Pass pass
[1]
  1. 1. All tests either passed or skipped. ./default/cachedrop PASS ./default/insert_leap_second PASS ./default/libhugetlbfs SKIP ./default/memfd PASS ./default/modsign PASS ./default/mq-memory-corruption PASS ./default/paxtest SKIP ./default/posix_timers PASS ./default/selinux-dac-controls PASS ./default/stack-randomness PASS ./default/sysfs-perms PASS ./default/timer-overhead PASS Test suite complete PASS Vulnerability status: /sys/devices/system/cpu/vulnerabilities/itlb_multihit:Not affected /sys/devices/system/cpu/vulnerabilities/l1tf:Not affected /sys/devices/system/cpu/vulnerabilities/mds:Not affected /sys/devices/system/cpu/vulnerabilities/meltdown:Not affected /sys/devices/system/cpu/vulnerabilities/spec_store_bypass:Mitigation: Speculative Store Bypass disabled via prctl and seccomp /sys/devices/system/cpu/vulnerabilities/spectre_v1:Mitigation: usercopy/swapgs barriers and __user pointer sanitization /sys/devices/system/cpu/vulnerabilities/spectre_v2:Mitigation: Full AMD retpoline, STIBP: disabled, RSB filling /sys/devices/system/cpu/vulnerabilities/srbds:Not affected /sys/devices/system/cpu/vulnerabilities/tsx_async_abort:Not affected 2. Test suite complete PASS Bandwidth measurements needed 71 minutes to complete
jayg
Pass pass
jishi Intel(R) Xeon(R) CPU X5650
Pass pass
[1]
Pass pass
[2]
  1. gre,vxlan and geneve basic test passed
  2. tested basic route addr, default route, rule and route prefix. all passed
joshm100@gmail.com
Pass pass
[1]
  1. Lenovo Yoga 730-13IKB
joydeep HP Pavilion, CPU: Intel Core i5-8250U, GPU:Intel Corporation UHD Graphics 620, DE: F32 Workstation
Pass pass
jsmith Jetson Nano B01
Pass pass
[1]
  1. Everything worked as expected.
kiko Asus X555LA
Pass pass
[1]
  1. Default and performance tests passed.
kokoseij Ryzen 3700X, 16GB RAM, X570 motherboard with 120GB SSD as root drive, Updated from existing Fedora 32 installation using koji.
Pass pass
[1]
  1. All Green, Nothing went wrong
laolux sudo ./runtests.sh
Fail fail
[1]
  1. Test suite called with default ./default/libhugetlbfs SKIP ./default/selinux-dac-controls PASS ./default/modsign PASS ./default/memfd PASS ./default/insert_leap_second PASS ./default/timer-overhead PASS ./default/stack-randomness PASS ./default/paxtest SKIP ./default/posix_timers PASS ./default/cachedrop FAIL ./default/sysfs-perms PASS ./default/mq-memory-corruption PASS Test suite complete FAIL
lnie Dell PowerEdge R805
Pass pass
[1]
  1. all test passed
losuler kerneltest-5.8.1.iso on GA-Z97-D3H, Intel Core i5-4690
Pass pass
[1]
  1. Test suite called with default. All PASS, expect ./default/paxtest and ./default/libhugetlbfs which were SKIP.
luoc Lenovo T14 Gen1 2020 with AMD Ryzen 7 Pro 4750U, kerneltest live image
Pass pass
[1]
  1. - All tests either passed or skipped. - The internal microphone is now recognized properly which isn’t the case with 5.7. However, internal speakers cannot be used when headphones are plugged in, not sure if that’s a desired behavior. Also, the dialog that let’s me chose between headset/headphones/current settings does not appear when something is plugged into the audio jack. Summary: Date: Fri 21 Aug 2020 01:16:01 PM EDT Test set: default Kernel: 5.8.2-300.fc32.x86_64 Release: Fedora release 32 (Thirty Two) Result: PASS Failed Tests: None Warned Tests: None
malucious Test image with libvirt. i7-6700K 4GB RAM.
Pass pass
[1]
  1. Paxtest was skipped. Mq-memory-corruption was skipped. I did receive the below error during the performance test. /bin/sh: ../scripts/getlist: Permission denied /bin/sh: ../scripts/getsummary: Permission denied make: *** [Makefile:110: summary] Error 126
manjay Testday image on Acer Nitro 5 AN515-52
Pass pass
[1]
  1. All tests either passed or skipped.
masami fedora 32, 5.8.1-300.fc32.x86_64, i7-9700K(UHD Graphics 630)
Pass pass
[1]
  1. Kernel regression tests passed. Works fine for daily use.
maximilianum kerneltest-5.8.1.iso running on VM (AMD Ryzen 9 3950X)
Pass pass
[1]
  1. Test suite called with default ./default/paxtest SKIP ./default/modsign PASS ./default/stack-randomness PASS ./default/insert_leap_second PASS ./default/sysfs-perms PASS ./default/cachedrop PASS ./default/timer-overhead PASS ./default/mq-memory-corruption PASS ./default/memfd PASS ./default/selinux-dac-controls PASS ./default/posix_timers PASS ./default/libhugetlbfs SKIP Test suite complete PASS Your log file is being submitted... Upload successful! The following information is not submitted with your log; it is for informational purposes only. Checking for kernel signature: The signer's common name is Fedora Secure Boot Signer The signer's common name is kernel-signer Vulnerability status: /sys/devices/system/cpu/vulnerabilities/itlb_multihit:Not affected /sys/devices/system/cpu/vulnerabilities/l1tf:Not affected /sys/devices/system/cpu/vulnerabilities/mds:Not affected /sys/devices/system/cpu/vulnerabilities/meltdown:Not affected /sys/devices/system/cpu/vulnerabilities/spec_store_bypass:Mitigation: Speculative Store Bypass disabled via prctl and seccomp /sys/devices/system/cpu/vulnerabilities/spectre_v1:Mitigation: usercopy/swapgs barriers and __user pointer sanitization /sys/devices/system/cpu/vulnerabilities/spectre_v2:Mitigation: Full AMD retpoline, IBPB: conditional, STIBP: disabled, RSB filling /sys/devices/system/cpu/vulnerabilities/srbds:Not affected /sys/devices/system/cpu/vulnerabilities/tsx_async_abort:Not affected
mharpau Thinkpad T480s, i5-8250U, iGPU
Pass pass
[1]
Pass pass
[2]
  1. Default and Performance: Pass
  2. 1. Default and Performance: Pass
mzink ThinkPad T480s
Pass pass
[1]
  1. no issues
nchudnoff AMD Phenom II x4 B93, 6GB RAM, QEMU/KVM test day image
Pass pass
[1]
Fail fail
[2]
  1. cachedrop PASS (prev. test had SELinux enabled)
  2. cachedrop FAIL; libhugetlbfs SKIP; paxtest SKIP; all other PASS. Performance: PASS
nielsenb Compaq 8510w Intel T9300 AMD RV630
Pass pass
noblesomto HP EliteBook 8460p core i5 6GB Ram fedora 33 Rawhide
Pass pass
[1]
  1. I noticed that my time and audio stopped working after i ran the test.
norbertj Testday image on Ideapad with Core i3-6006U and 8 GiB RAM
Pass pass
[1]
  1. paxtest and libhugetlbfs SKIP, rest of default tests and performance tests PASS. No regressions noted.
norbertj Testday image on desktop with Ryzen 3 3200G and 16 GiB RAM
Pass pass
[1]
  1. paxtest and libhugetlbfs SKIP, rest of default tests and performance tests PASS. No regressions noted.
norbertj Testday image on old desktop with Core i5-750, 4 GiB RAM and Radeon HD6450
Pass pass
[1]
  1. paxtest and libhugetlbfs SKIP, rest of default tests PASS. Performance tests aborted because of heavy swap activity due to lack of RAM (/var/tmp filled up to 100%). No regressions noted.
ntonnaett MB: MSI B250M PRO-VD(MS-7A74), CPU: Intel Pentium G4560, GPU: Radeon RX 5500, Fedora 32
Pass pass
[1]
  1. RHBZ #1871324 PASSED, but: There were compilation warnings and this line in dmesg: lat_rpc[7271]: segfault at 1000 ip 00007ff47277deda sp 00007ffe3063ebb8 error 4 in libc-2.31.so[7ff472703000+150000] I've already used vanilla rc versions before because the graphics driver had less bugs. There's only one amdgpu bug left now. It's no regression. 5.8 is the most stable kernel version in Fedora 32 for me.
pany Macbook Pro 13 (early 2015) i5-5257U
Pass pass
[1]
  1. Default: Pass Performance: Pass
pgsh 5.8.2-300.fc32.x86_64 on AMD A6-7400K
Warning warn
[1]
  1. 1) WARN & SKIP Messages seen during default test suite run: ./default/paxtest SKIP ./default/sysfs-perms WARN ./default/libhugetlbfs SKIP Test suite complete WARN 2)performance test suite resulted in "Test suite complete PASS "
quiet VM with Fedora 32 (Workstation Edition, 64-bit, KVM, Wayland, Gnome 3.36.4): RAM 1.9 GB, Intel® Core™ i7-8665U CPU @ 1.90GHz × 8, graphics llvmpipe (LLVM 10.0.0, 256 bits), HDD 21.5 GB
Pass pass
[1]
  1. Test suite called with default ./default/cachedrop PASS ./default/selinux-dac-controls PASS ./default/stack-randomness PASS ./default/sysfs-perms PASS ./default/libhugetlbfs SKIP ./default/insert_leap_second PASS ./default/posix_timers PASS ./default/timer-overhead PASS ./default/memfd PASS ./default/modsign PASS ./default/paxtest SKIP ./default/mq-memory-corruption PASS Test suite complete PASS Tue 18 Aug 2020 11:02:19 AM CEST /bin/sh: ../scripts/getlist: Permission denied /bin/sh: ../scripts/getsummary: Permission denied make: *** [Makefile:110: summary] Error 126 ./performance/lmbench3 PASS Test suite complete PASS
rootxaman Test day image on Acer Predator Helios 300 (PH315-51)
Pass pass
[1]
  1. 1. All tests either passed or skipped.
schminkey Dell XPS 13 9370
Pass pass
[1]
  1. All is well
sgraf NUC10i7FNH / Intel Core i7-10710U / 5.8.1-300.fc32.x86_64
Pass pass
[1]
  1. All passed. Vulnerability status: /sys/devices/system/cpu/vulnerabilities/itlb_multihit:KVM: Mitigation: Split huge pages /sys/devices/system/cpu/vulnerabilities/l1tf:Not affected /sys/devices/system/cpu/vulnerabilities/mds:Not affected /sys/devices/system/cpu/vulnerabilities/meltdown:Not affected /sys/devices/system/cpu/vulnerabilities/spec_store_bypass:Mitigation: Speculative Store Bypass disabled via prctl and seccomp /sys/devices/system/cpu/vulnerabilities/spectre_v1:Mitigation: usercopy/swapgs barriers and __user pointer sanitization /sys/devices/system/cpu/vulnerabilities/spectre_v2:Mitigation: Enhanced IBRS, IBPB: conditional, RSB filling /sys/devices/system/cpu/vulnerabilities/srbds:Not affected /sys/devices/system/cpu/vulnerabilities/tsx_async_abort:Not affected
shiwanibiradar fedora32 kvm ram2gb cpu 1
Pass pass
[1]
  1. All Passed, except ./default/libhugetlbfs SKIP ./default/paxtest SKIP
spoeplau Lenovo T14s Gen1 2020 with AMD Ryzen 7 Pro 4750U, kerneltest live image
Pass pass
[1]
  1. All tests passed. Sleep on closing the lid is unreliable: sometimes the laptop does not suspend, while other times it does. (Suspend mode is set to "Linux" in the BIOS ACPI settings; waking up is not a problem.)
sumantrom Test day image on KVM
Fail fail
tdmackey Dell XPS 13 7390 Intel Core i7-10710U
Pass pass
[1]
  1. Default: Pass Performance: Pass. dmesg looks good.
tharadash Testday image on Dell Vostro 5471
Pass pass
[1]
Pass pass
[2]
  1. All tests either passed or skipped on 5.8.2 image.
  2. All tests either passed or skipped.
tharadash Testday image on GA-Z77-D3H, i7-3770K, RX 570
Pass pass
[1]
Pass pass
[2]
  1. All tests either passed or skipped on 5.8.2 image.
  2. All tests either passed or skipped.
tharadash Testday image on HP Compaq Elite 8300 SFF (QV996AV)
Pass pass
[1]
Pass pass
[2]
  1. All tests either passed or skipped on 5.8.2 image.
  2. All tests either passed or skipped.
tharadash Testday image on HP ENVY X360 (6EM61EA)
Pass pass
[1]
Pass pass
[2]
  1. All tests either passed or skipped on 5.8.2 image.
  2. All tests either passed or skipped.
tharadash Testday image on HP EliteBook 820 G1 (D7V74AV)
Pass pass
[1]
  1. All tests either passed or skipped.
tharadash Testday image on HP EliteBook 820 G2 (F6N32AV)
Pass pass
[1]
Pass pass
[2]
  1. All tests either passed or skipped on 5.8.2 image.
  2. All tests either passed or skipped.
tharadash Testday image on HP EliteBook 840 G3 (L3C67AV)
Pass pass
[1]
Pass pass
[2]
  1. All tests either passed or skipped on 5.8.2 image.
  2. All tests either passed or skipped.
tharadash Testday image on HP EliteBook 850 G6 (4YD63AV)
Pass pass
[1]
Pass pass
[2]
  1. All tests either passed or skipped on 5.8.2 image.
  2. All tests either passed or skipped.
tharadash Testday image on HP EliteBook Folio 9470m (B7S88AV)
Pass pass
[1]
Pass pass
[2]
  1. All tests either passed or skipped on 5.8.2 image.
  2. All tests either passed or skipped.
tharadash Testday image on HP EliteDesk 800 G3 SFF (Y2Z63AV)
Pass pass
[1]
Pass pass
[2]
  1. All tests either passed or skipped on 5.8.2 image.
  2. All tests either passed or skipped.
tharadash Testday image on Hyper-V (Windows 10 1909 x64)
Pass pass
[1]
  1. All tests either passed or skipped.
tharadash Testday image on Intel NUC DC53427HYE
Pass pass
[1]
Pass pass
[2]
  1. All tests either passed or skipped on 5.8.2 image.
  2. All tests either passed or skipped.
tharadash Testday image on VMware Workstation Player 15.5.6 build-16341506 (Windows 10 1909 x64)
Fail fail
[1]
  1. On standard tests: ./default/cachedrop failed Everything else either skipped or passed. Vulnerability status: /sys/devices/system/cpu/vulnerabilities/itlb_multihit:KVM: Mitigation: Split huge pages /sys/devices/system/cpu/vulnerabilities/l1tf:Mitigation: PTE Inversion; VMX: flush not necessary, SMT disabled /sys/devices/system/cpu/vulnerabilities/mds:Mitigation: Clear CPU buffers; SMT Host state unknown /sys/devices/system/cpu/vulnerabilities/meltdown:Mitigation: PTI /sys/devices/system/cpu/vulnerabilities/spec_store_bypass:Mitigation: Speculative Store Bypass disabled via prctl and seccomp /sys/devices/system/cpu/vulnerabilities/spectre_v1:Mitigation: usercopy/swapgs barriers and __user pointer sanitization /sys/devices/system/cpu/vulnerabilities/spectre_v2:Mitigation: Full generic retpoline, IBPB: conditional, IBRS_FW, STIBP: disabled, RSB filling /sys/devices/system/cpu/vulnerabilities/srbds:Unknown: Dependent on hypervisor status /sys/devices/system/cpu/vulnerabilities/tsx_async_abort:Not affected
theo3000 live test usb on thinkpad x1 exteme g2 / i7-9750H 12c / 32gb ram
Pass pass
[1]
Pass pass
[2]
  1. performance tests passed
  2. 1. all default tests passed
theo3000 test-image on fed32ws kvm on thinkpad x1 extreme gen 2 / 8gb ram / intel i7-9750H CPU @ 2.60GHz × 12 / llvmpipe (LLVM 10.0.0, 256 bits) gpu / 30gb ssd
Pass pass
[1]
  1. passed all tests
tseewald Dell Latitude 7490 (Intel i7-8650U, UHD 620, 16GB RAM, 970 EVO)
Pass pass
[1]
  1. Default and performance tests passed. No new warnings or errors in dmesg.
twohot Asus N56VJ i7 Processor, 8GB RAM F34 (Rawhide) Workstation
Pass pass
[1]
  1. /sys/devices/system/cpu/vulnerabilities/itlb_multihit:KVM: Mitigation: Split huge pages /sys/devices/system/cpu/vulnerabilities/l1tf:Mitigation: PTE Inversion; VMX: conditional cache flushes, SMT vulnerable /sys/devices/system/cpu/vulnerabilities/mds:Mitigation: Clear CPU buffers; SMT vulnerable /sys/devices/system/cpu/vulnerabilities/meltdown:Mitigation: PTI /sys/devices/system/cpu/vulnerabilities/spec_store_bypass:Mitigation: Speculative Store Bypass disabled via prctl and seccomp /sys/devices/system/cpu/vulnerabilities/spectre_v1:Mitigation: usercopy/swapgs barriers and __user pointer sanitization /sys/devices/system/cpu/vulnerabilities/spectre_v2:Mitigation: Full generic retpoline, IBPB: conditional, IBRS_FW, STIBP: conditional, RSB filling /sys/devices/system/cpu/vulnerabilities/srbds:Vulnerable: No microcode /sys/devices/system/cpu/vulnerabilities/tsx_async_abort:Not affected
twohot Zinox Laptop i5 4GB RAM
Warning warn
[1]
  1. Reports a PASS whereas the test crashed. /usr/bin/ld: skipping incompatible /usr/lib/gcc/x86_64-redhat-linux/10/../../../libtirpc.so when searching for -ltirpc /usr/bin/ld: skipping incompatible /lib/libtirpc.so when searching for -ltirpc /usr/bin/ld: skipping incompatible /usr/lib/libtirpc.so when searching for -ltirpc /usr/bin/ld: cannot find -ltirpc collect2: error: ld returned 1 exit status gmake[2]: *** [Makefile:293: ../bin/x86_64-linux-gnu/bw_file_rd] Error 1 make[1]: *** [Makefile:114: lmbench] Error 2 make: *** [Makefile:20: build] Error 2
zsun 5.8.0-1.fc33.x86_64 Intel i7-3770, B75 chipset
Pass pass
[1]
  1. I've been using this kernel version since it finished built on Koji. No issues found so far.